[an error occurred while processing this directive]
mod_pagespeedと引き続き格闘中です。誰か助けて▲('A`)

第210日目:mod_pagespeedと引き続き格闘中です。誰か助けて▲('A`)

【追記 11/13 17:00】
どうも、▲('A`)/です。
今日はお休み、と言う方もいるかもしれませんが、会社に来ています、シクシク。

いやあ、mod_pagespeedのコンパイルで苦しんでいるのは、FreeBSDユーザだけでは無いんですね。
googleさんのサイトのココで報告が上がっていましたが、どうもLinuxでも
ubuntuやCentOS以外のディストリビューションの人はコンパイルでエラーになっているようです。
(しかも▲('A`)が報告したエラーのメッセージと全く同じ内容です、ハイ。)
報告してくれた人はsuse8.1を使っているんだそうです。
で、GCCのバージョンは4.5.1だそうです。

あ、そうそう。
ubuntuやCentOSでインストールに成功した人も注意して下さいよ。
なんでも、バグfix版のソースが公開されたようです。
詳しくはこちらをご覧になって、必要なら入手及び再コンパイルして下さい。
で、バイナリについては11/15(たぶん米国時間)にリリースするつもり、だとの事です。

[原文(ママ)]
Hi, 
We have just pushed a new revision of mod_pagespeed to the open-source 
repository, fixing the following issues:

In this version of the software, rewrite_css and rewrite_javascript are 
still off by default -- they are not in the Core Filters.  But we are 
gaining confidence in them and invite you to try them by turning them on 
explicitly with .conf file directives. 


This is Subversion change: * 
http://code.google.com/p/modpagespeed/source/detail?r=183*
↑
このURLをクリックしても404ページしか表示されません。
最後の* を削除してからアクセスして下さい。
(ってか、googleさんも、罠をしかけないで欲しい・・・まったく。)

If you can do a build from open-source, you can try these changes now by 
typing "svn update", then rebuilding and re-installing.  We will be 
releasing a new set of binaries on Monday Nov 15. 
↑
最後の文章で「will be releasing(リリースする"つもり"です。)」となっている処に注意。
 

なんか、急いで導入すると、後追いで色々やらなきゃいけない事が出てくる予感・・・
急がない方がいいのかなあ・・・・

以上、緊急報告でした、ハイ。

あ、ここから本編が始まります。
それでは、どうぞ。

どうも、▲('A`)です。
えーと、お日様を見かけなくなって、結構経ちます。
精神的にも「どよーん」としてしまって、あまり宜しくないです。

さて、今日も短めの日記になります。というか、エラーが判らなくてのたうちまわっています。

えーと昨日の日記で追記として、mod_pagespeedのソースを固めたものを置いておきました。
で、今日はさっそくコンパイルをしているのですが、エラー出まくりです。。。
参考までに今まで判った事を今日の日記で報告しておきますね。

まず、ソースを設置するところからです。

cd /tmp
fetch fetch http://dokuo3.maido3.com/mod_pagespeed.tgz
tar zxvf mod_pagespeed.tgz
cd mod_pagespeed/src
gmake BUILDTYPE=Release

・・・っと、その前にサーバに以下のものが入っているかもう一度確かめて下さい。
1) Apache 2.2系がインストールされている。
  スーパーユーザモードで httpd -v でバージョンが表示されるので、見て下さい。
2) gmake、libexecinfo、bashがインストールされている。 pkg_infoとかで確認して下さい。 libexecinfoはexecinfo.hを使う為にインストールします。
3) gccのバージョンが4.2以上である。 gcc -v と叩くとバージョンが表示されます。 ちなみにFreeBSD 8.1-RELEASEで標準で入ってくるのは4.2.1です。
4) 以下のコマンドを実行してbash、execinfoにスタティックリンクを貼って下さい。 ln -s /usr/local/include/execinfo.h /usr/include/execinfo.h ln -s /usr/local/bin/bash /bin/bash これはlinuxとFreeBSDでは該当のプログラムやファイルの設置場所が異なるので、 そのままコンパイルするとエラーになります。

で、ここまで済んだら初めて gmake BUILDTYPE=Release のコマンドを実行します。
もしも、4)を忘れると以下の様なエラーが表示されます。
(早い段階でエラーになります。)

# gmake BUILDTYPE=Release
  CC(target) out/Release/obj.target/base/third_party/chromium/src/base/third_party/dynamic_annotations/
  dynamic_annotations.o
  CXX(target) out/Release/obj.target/base/third_party/chromium/src/base/third_party/dmg_fp/dtoa.o
  CXX(target) out/Release/obj.target/base/third_party/chromium/src/base/third_party/dmg_fp/g_fmt.o
  CXX(target) out/Release/obj.target/base/third_party/chromium/src/base/third_party/nspr/prtime.o
  CXX(target) out/Release/obj.target/base/third_party/chromium/src/base/atomicops_internals_x86_gcc.o
  CXX(target) out/Release/obj.target/base/third_party/chromium/src/base/at_exit.o
  CXX(target) out/Release/obj.target/base/third_party/chromium/src/base/debug_util.o
  CXX(target) out/Release/obj.target/base/third_party/chromium/src/base/debug_util_posix.o
In file included from third_party/chromium/src/base/debug_util_posix.cc:28:
third_party/chromium/src/base/compat_execinfo.h:31:22: warning: execinfo.h: No such file or directory
third_party/chromium/src/base/debug_util_posix.cc: In function 'bool<unnamed>::GetBacktraceStrings
(void**, int, std::vector<std::basic_string<char, std::char_traits<char>, 
std::allocator<char> >, std::allocator<std::
basic_string<char, std::char_traits<char>, std::allocator<char> > > >*)':
third_party/chromium/src/base/debug_util_posix.cc:119: error: 'backtrace_symbols' was not declared
 in this scope
third_party/chromium/src/base/debug_util_posix.cc: In constructor 'StackTrace::StackTrace()':
third_party/chromium/src/base/debug_util_posix.cc:270: error: 'backtrace' was not declared 
in this scope
gmake: *** [out/Release/obj.target/base/third_party/chromium/src/base/debug_util_posix.o] Error 1
# 

さて、前述の 1) 〜 4) まで整えて実行しても、現時点では以下のエラーが表示されます。トホホ・・・
泣きたいです、ハイ。

# gmake BUILDTYPE=Release


(省略)

  CXX(target) out/Release/obj.target/protobuf/third_party/protobuf2/src/src/google/protobuf/
  compiler/parser.o
  AR(target) out/Release/obj.target/third_party/protobuf2/libprotobuf.a
  CXX(target) out/Release/obj.target/base64/third_party/base64/base64.o
  AR(target) out/Release/obj.target/third_party/base64/libbase64.a
  CXX(target) out/Release/obj.target/url_to_filename_encoder/third_party/chromium/src/net/
  tools/dump_cache/
  url_to_filename_encoder.o
  AR(target) out/Release/obj.target/third_party/chromium/src/net/tools/
  liburl_to_filename_encoder.a
  RULE pagespeed_genproto_genproto_1 out/Release/obj/gen/protoc_out/pagespeed/proto/
  pagespeed_output.pb.h
  RULE pagespeed_genproto_genproto_0 out/Release/obj/gen/protoc_out/pagespeed/proto/
  pagespeed_input.pb.h
  TOUCH out/Release/obj.target/third_party/libpagespeed/src/pagespeed/proto/
  pagespeed_genproto.stamp
  CXX(target) out/Release/obj.target/pagespeed_output_pb/gen/protoc_out/pagespeed/proto/
  pagespeed_output.pb.o
In file included from out/Release/obj/gen/protoc_out/pagespeed/proto/
pagespeed_output.pb.cc:4:
out/Release/obj/gen/protoc_out/pagespeed/proto/pagespeed_output.pb.h:1470: error: expected 
unqualified-id before 'int'
out/Release/obj/gen/protoc_out/pagespeed/proto/pagespeed_output.pb.h:1470: error: expected 
`)' before 'int'
out/Release/obj/gen/protoc_out/pagespeed/proto/pagespeed_output.pb.h:1470: error: expected 
`)' before 'int'
out/Release/obj/gen/protoc_out/pagespeed/proto/pagespeed_output.pb.h:1477: error: expected 
unqualified-id before 'int'
out/Release/obj/gen/protoc_out/pagespeed/proto/pagespeed_output.pb.h:1477: error: expected 
`)' before 'int'
out/Release/obj/gen/protoc_out/pagespeed/proto/pagespeed_output.pb.h:1477: error: expected 
`)' before 'int'
out/Release/obj/gen/protoc_out/pagespeed/proto/pagespeed_output.pb.h:2930: error: expected 
unqualified-id before '(' token
out/Release/obj/gen/protoc_out/pagespeed/proto/pagespeed_output.pb.h:2946: error: expected 
unqualified-id before '(' token
out/Release/obj/gen/protoc_out/pagespeed/proto/pagespeed_output.pb.cc: In member function 
'virtual void pagespeed::Version::
SerializeWithCachedSizes(google::protobuf::io::CodedOutputStream*) const':
out/Release/obj/gen/protoc_out/pagespeed/proto/pagespeed_output.pb.cc:3492: error: expected 
unqualified-id before '(' token
out/Release/obj/gen/protoc_out/pagespeed/proto/pagespeed_output.pb.cc:3492: error: expected 
primary-expression before 'int'
out/Release/obj/gen/protoc_out/pagespeed/proto/pagespeed_output.pb.cc:3492: error: expected 
`)' before 'int'
out/Release/obj/gen/protoc_out/pagespeed/proto/pagespeed_output.pb.cc:3497: error: expected 
unqualified-id before '(' token
out/Release/obj/gen/protoc_out/pagespeed/proto/pagespeed_output.pb.cc:3497: error: expected 
primary-expression before 'int'
out/Release/obj/gen/protoc_out/pagespeed/proto/pagespeed_output.pb.cc:3497: error: expected 
`)' before 'int'
out/Release/obj/gen/protoc_out/pagespeed/proto/pagespeed_output.pb.cc: In member function 
'virtual int pagespeed::Version::
ByteSize() const':
out/Release/obj/gen/protoc_out/pagespeed/proto/pagespeed_output.pb.cc:3515: error: expected 
unqualified-id before '(' token
out/Release/obj/gen/protoc_out/pagespeed/proto/pagespeed_output.pb.cc:3515: error: expected 
primary-expression before 'int'
out/Release/obj/gen/protoc_out/pagespeed/proto/pagespeed_output.pb.cc:3515: error: expected 
`)' before 'int'
out/Release/obj/gen/protoc_out/pagespeed/proto/pagespeed_output.pb.cc:3522: error: expected 
unqualified-id before '(' token
out/Release/obj/gen/protoc_out/pagespeed/proto/pagespeed_output.pb.cc:3522: error: expected 
primary-expression before 'int'
out/Release/obj/gen/protoc_out/pagespeed/proto/pagespeed_output.pb.cc:3522: error: expected 
`)' before 'int'
out/Release/obj/gen/protoc_out/pagespeed/proto/pagespeed_output.pb.cc: In member function 
'void pagespeed::Version::
MergeFrom(const pagespeed::Version&)':
out/Release/obj/gen/protoc_out/pagespeed/proto/pagespeed_output.pb.cc:3546: error: expected 
unqualified-id before '(' token
out/Release/obj/gen/protoc_out/pagespeed/proto/pagespeed_output.pb.cc:3546: error: expected 
primary-expression before 'int'
out/Release/obj/gen/protoc_out/pagespeed/proto/pagespeed_output.pb.cc:3546: error: expected 
`)' before 'int'
out/Release/obj/gen/protoc_out/pagespeed/proto/pagespeed_output.pb.cc:3549: error: expected 
unqualified-id before '(' token
out/Release/obj/gen/protoc_out/pagespeed/proto/pagespeed_output.pb.cc:3549: error: expected 
primary-expression before 'int'
out/Release/obj/gen/protoc_out/pagespeed/proto/pagespeed_output.pb.cc:3549: error: expected 
`)' before 'int'
gmake: *** [out/Release/obj.target/pagespeed_output_pb/gen/protoc_out/pagespeed/proto/
pagespeed_output.pb.o] Error 1
# 

ちなみにmod_pagespeedのソースはココからご覧いただけます。
pagespeed_output.pb.cc はこちらから見れます。
pagespeed_output.pb.h はこちらから見れます。
えーと、cのプログラム判らないので、何がどうなっているかちんぷんかんぷんです。。。
誰か助けて下さい・・・

いきなり大きな壁にぶつかった様です。。。
もうすこし足掻いてみようと思います
でもね、期待しないで下さいね。
できれば、他の人も挑戦して頂けると助かります。
全然情報が引っかからないです。
(自分のダメだった結果がgoogleさんでヒットすると、鬱になります、ハイ。)

それでは、また。▲('A`)/

【追記 11/12 17:55】
どうも、▲('A`)/です。
えーと、もしかして、と思って、gcc4.2.5 をportsから入れて、以下のコマンドで
差し替えしてもう一度makeしてみましたが、同じエラーとなりました。
あ、FreeBSDのgccは4.2.1です。結構古いバージョンです。
で、portsからインストールしただけでは、差し替わりませんのでご注意を。
cd /usr/ports/lang/gcc42
make install clean
rehash

インストール先は /usr/local/bin/ です。/usr/local/bin/gcc42 という風になっています。
で、デフォルトで動いているgccは /usr/bin にあります。
差し替える時はこんな感じでお願いします。
cd /usr/bin mv gcc gcc_4.2.1 ln -s /usr/local/bin/gcc42 /usr/bin/gcc で、バージョンを確認して下さい。 gcc -v Using built-in specs. Target: x86_64-portbld-freebsd8.1 Configured with: ./../gcc-4.2-20090325/configure --disable-nls --libdir=/usr/local/lib/gcc42 --libexecdir=/usr/local/libexec/gcc42 --program-suffix=42 --with-as=/usr/bin/as --with-gmp=/usr/local --with-gxx-include-dir=/usr/local/lib/gcc42/include/c++/ --with-ld=/usr/bin/ld --with-libiconv-prefix=/usr/local --with-system-zlib --disable-rpath --enable-libgcj --prefix=/usr/local --mandir=/usr/local/man --infodir=/usr/local/info/gcc42 x86_64-portbld-freebsd8.1 Thread model: posix gcc version 4.2.5 20090325 (prerelease)

さてさて、また社内サーバにubuntuを入れて、もう一度Linux上でコンパイルしてみますか。
何か得られるかも・・・
でも、あまり期待しないでね。
それでは、また。▲('A`)/

209日目に戻る。   211日目に続く。

目次に戻る
1日目 2日目 3日目 4日目 5日目 6日目 7日目
8日目 9日目 10日目 11日目 12日目 13日目 14日目
15日目 16日目 17日目 18日目 19日目 20日目 21日目
22日目 23日目 24日目 25日目 26日目 27日目 28日目
29日目 30日目 31日目 32日目 33日目 34日目 35日目
36日目 37日目 38日目 39日目 40日目 41日目 42日目
43日目 44日目 45日目 46日目 47日目 48日目 49日目
50日目 51日目 52日目 53日目 54日目 55日目 56日目
57日目 58日目 59日目 60日目 61日目 62日目 63日目
64日目 65日目 66日目 67日目 68日目 69日目 70日目
71日目 72日目 73日目 74日目 75日目 76日目 77日目
78日目 79日目 80日目 81日目 82日目 83日目 84日目
85日目 86日目 87日目 88日目 89日目 90日目 91日目
92日目 93日目 94日目 95日目 96日目 97日目 98日目
99日目 100日目 101日目 102日目 103日目 104日目 105日目
106日目 107日目 108日目 109日目 110日目 111日目 112日目
113日目 114日目 115日目 116日目 117日目 118日目 119日目
120日目 121日目 122日目 123日目 124日目 125日目 126日目
127日目 128日目 129日目 130日目 131日目 132日目 133日目
134日目 135日目 136日目 137日目 138日目 139日目 140日目
141日目 142日目 143日目 144日目 145日目 146日目 147日目
148日目 149日目 150日目 151日目 152日目 153日目 154日目
155日目 156日目 157日目 158日目 159日目 160日目 161日目
162日目 163日目 164日目 165日目 166日目 167日目 168日目
169日目 170日目 171日目 172日目 173日目 174日目 175日目
176日目 177日目 178日目 179日目 180日目 181日目 182日目
183日目 184日目 185日目 186日目 187日目 188日目 189日目
190日目 191日目 192日目 193日目 194日目 195日目 196日目
197日目 198日目 199日目 200日目 201日目 202日目 203日目
204日目 205日目 206日目 207日目 208日目 209日目 210日目
211日目 212日目 213日目 214日目 215日目 216日目 217日目
218日目 219日目 220日目 221日目 222日目 223日目 224日目
225日目 226日目 227日目 228日目 229日目 230日目 231日目
232日目 233日目 234日目 235日目 236日目 237日目 238日目
239日目 240日目 241日目 242日目 243日目 244日目 245日目
246日目 247日目 248日目 249日目 250日目 251日目 252日目
253日目 254日目 255日目 256日目 257日目 258日目 259日目
260日目 261日目 262日目 263日目 264日目 265日目 266日目
267日目 268日目 269日目 270日目 271日目 272日目 273日目
274日目 275日目 276日目 277日目 278日目 279日目 280日目
281日目 282日目 283日目 284日目 285日目 286日目 287日目
288日目 289日目 290日目 291日目 292日目 293日目 294日目
295日目 296日目 297日目 298日目 299日目 300日目 301日目
302日目 303日目 304日目 305日目 306日目 307日目 308日目
309日目 310日目 311日目 312日目 313日目 314日目 315日目
316日目 317日目 318日目 319日目 320日目 321日目 322日目
323日目 324日目 325日目 326日目 327日目 328日目 329日目
330日目 331日目 332日目 333日目 334日目 335日目 336日目
337日目 338日目 339日目 340日目 341日目 342日目 343日目
344日目 345日目 346日目 347日目 348日目 349日目 350日目
351日目 352日目 353日目 354日目 355日目 356日目 357日目
358日目 359日目 360日目 361日目 362日目 363日目 364日目

いま一番お得なページ! 解析
[an error occurred while processing this directive]